Reaction Details
TargetCyclin-dependent kinase 5 activator 1
LigandBDBM50393112
Substrate/Competitorn/a
Meas. Tech.ChEMBL_853876 (CHEMBL2154996)
IC50 11000±n/a nM
Citation Shengule, SRLoa-Kum-Cheung, WLParish, CRBlairvacq, MMeijer, LNakao, YKaruso, P A one-pot synthesis and biological activity of ageladine A and analogues. J Med Chem54:2492-503 (2011) 
 
Cyclin-dependent kinase 5 activator 1
Name:Cyclin-dependent kinase 5 activator 1
Type:Protein Complex
Mol. Mass.:n/a
Description:n/a
Components:This complex has 2 components.
Component 1
Name:Cyclin-dependent kinase 5
Synonyms:CDK5 CDKN5 Cyclin-dependent kinase 5 (CDK5/ p25) Cyclin-dependent-like kinase 5 PSSALRE Tau protein kinase II catalytic subunit
Type:Enzyme Subunit
Mol. Mass.:33308.61
Organism:Homo sapiens (Human)
Description:n/a
Residue:292
Component 2
Name:Cyclin-dependent kinase 5 activator 1
Synonyms:CD5R1_HUMAN CDK5R1 Cyclin-dependent kinase 5 (CDK5/p25) NCK5A p35
Type:Enzyme Subunit
Mol. Mass.:34077.43
Organism:Homo sapiens (Human)
Description:Q15078
Residue:307
BDBM50393112
NameBDBM50393112
Synonyms:CHEMBL2153263
TypeSmall organic molecule
Emp. Form.C10H8N4S
Mol. Mass.216.262
SMILESNc1nc2c(nccc2[nH]1)-c1ccsc1