Reaction Details
TargetMacrophage metalloelastase
LigandBDBM50215926
Substrate/Competitorn/a
Meas. Tech.ChEMBL_853827 (CHEMBL2154853)
IC50 924±n/a nM
Citation Shengule, SRLoa-Kum-Cheung, WLParish, CRBlairvacq, MMeijer, LNakao, YKaruso, P A one-pot synthesis and biological activity of ageladine A and analogues. J Med Chem54:2492-503 (2011) 
 
Macrophage metalloelastase
Name:Macrophage metalloelastase
Type:Enzyme
Mol. Mass.:54012.99
Organism:Homo sapiens (Human)
Description:P39900
Residue:470
BDBM50215926
NameBDBM50215926
Synonyms:4-(4,5-dibromo-1H-pyrrol-2-yl)-1H-imidazo[4,5-c]pyridin-2-amine CHEMBL230806
TypeSmall organic molecule
Emp. Form.C10H7Br2N5
Mol. Mass.357.004
SMILESNc1nc2c(nccc2[nH]1)-c1cc(Br)c(Br)[nH]1