Reaction Details
TargetCalcium/calmodulin-dependent protein kinase kinase 1
LigandBDBM50393109
Substrate/Competitorn/a
Meas. Tech.ChEMBL_853857 (CHEMBL2154883)
Kd 40000±n/a nM
Citation Shengule, SRLoa-Kum-Cheung, WLParish, CRBlairvacq, MMeijer, LNakao, YKaruso, P A one-pot synthesis and biological activity of ageladine A and analogues. J Med Chem54:2492-503 (2011) 
 
Calcium/calmodulin-dependent protein kinase kinase 1
Name:Calcium/calmodulin-dependent protein kinase kinase 1
Type:PROTEIN
Mol. Mass.:55727.76
Organism:Homo sapiens (Human)
Description:ChEMBL_774623
Residue:505
BDBM50393109
NameBDBM50393109
Synonyms:CHEMBL2153264
TypeSmall organic molecule
Emp. Form.C11H9N5
Mol. Mass.211.2227
SMILESNc1nc2c(nccc2[nH]1)-c1ccccn1