Reaction Details
TargetSerine/threonine-protein kinase ULK1
LigandBDBM50393109
Substrate/Competitorn/a
Meas. Tech.ChEMBL_853870 (CHEMBL2154990)
Kd 24000±n/a nM
Citation Shengule, SRLoa-Kum-Cheung, WLParish, CRBlairvacq, MMeijer, LNakao, YKaruso, P A one-pot synthesis and biological activity of ageladine A and analogues. J Med Chem54:2492-503 (2011) 
 
Serine/threonine-protein kinase ULK1
Name:Serine/threonine-protein kinase ULK1
Type:PROTEIN
Mol. Mass.:112661.80
Organism:Homo sapiens (Human)
Description:ChEMBL_1510275
Residue:1050
BDBM50393109
NameBDBM50393109
Synonyms:CHEMBL2153264
TypeSmall organic molecule
Emp. Form.C11H9N5
Mol. Mass.211.2227
SMILESNc1nc2c(nccc2[nH]1)-c1ccccn1