Reaction Details
TargetCasein kinase I isoform alpha
LigandBDBM50393109
Substrate/Competitorn/a
Meas. Tech.ChEMBL_853878 (CHEMBL2154998)
IC50 10000±n/a nM
Citation Shengule, SRLoa-Kum-Cheung, WLParish, CRBlairvacq, MMeijer, LNakao, YKaruso, P A one-pot synthesis and biological activity of ageladine A and analogues. J Med Chem54:2492-503 (2011) 
 
Casein kinase I isoform alpha
Name:Casein kinase I isoform alpha
Type:PROTEIN
Mol. Mass.:14639.55
Organism:Sus scrofa
Description:ChEMBL_939731
Residue:125
BDBM50393109
NameBDBM50393109
Synonyms:CHEMBL2153264
TypeSmall organic molecule
Emp. Form.C11H9N5
Mol. Mass.211.2227
SMILESNc1nc2c(nccc2[nH]1)-c1ccccn1