Reaction Details
TargetSerine/threonine-protein kinase pim-1
LigandBDBM50215926
Substrate/Competitorn/a
Meas. Tech.ChEMBL_853880 (CHEMBL2155000)
IC50 10000±n/a nM
Citation Shengule, SRLoa-Kum-Cheung, WLParish, CRBlairvacq, MMeijer, LNakao, YKaruso, P A one-pot synthesis and biological activity of ageladine A and analogues. J Med Chem54:2492-503 (2011) 
 
Serine/threonine-protein kinase pim-1
Name:Serine/threonine-protein kinase pim-1
Type:Protein
Mol. Mass.:35681.82
Organism:Homo sapiens (Human)
Description:P11309
Residue:313
BDBM50215926
NameBDBM50215926
Synonyms:4-(4,5-dibromo-1H-pyrrol-2-yl)-1H-imidazo[4,5-c]pyridin-2-amine CHEMBL230806
TypeSmall organic molecule
Emp. Form.C10H7Br2N5
Mol. Mass.357.004
SMILESNc1nc2c(nccc2[nH]1)-c1cc(Br)c(Br)[nH]1