Reaction Details
TargetDual specificity tyrosine-phosphorylation-regulated kinase 1A
LigandBDBM50393114
Substrate/Competitorn/a
Meas. Tech.ChEMBL_853852 (CHEMBL2154878)
IC50 40000±n/a nM
Citation Shengule, SRLoa-Kum-Cheung, WLParish, CRBlairvacq, MMeijer, LNakao, YKaruso, P A one-pot synthesis and biological activity of ageladine A and analogues. J Med Chem54:2492-503 (2011) 
 
Dual specificity tyrosine-phosphorylation-regulated kinase 1A
Name:Dual specificity tyrosine-phosphorylation-regulated kinase 1A
Type:Enzyme Catalytic Domain
Mol. Mass.:85573.59
Organism:RAT
Description:Dual-specificity tyrosine-(Y)-phosphorylation regulated kinase 1A 0 RAT::Q63470
Residue:763
BDBM50393114
NameBDBM50393114
Synonyms:CHEMBL2153267
TypeSmall organic molecule
Emp. Form.C12H10N4
Mol. Mass.210.2346
SMILESNc1nc2c(nccc2[nH]1)-c1ccccc1