Reaction Details
TargetBromodomain-containing protein 3
LigandBDBM50365264
Substrate/Competitorn/a
Meas. Tech.ChEMBL_852804 (CHEMBL2156111)
Kd 19±n/a nM
Citation Chung, CWCoste, HWhite, JHMirguet, OWilde, JGosmini, RLDelves, CMagny, SMWoodward, RHughes, SABoursier, EVFlynn, HBouillot, AMBamborough, PBrusq, JMGellibert, FJJones, EJRiou, AMHomes, PMartin, SLUings, IJToum, JClement, CABoullay, ABGrimley, RLBlandel, FMPrinjha, RKLee, KKirilovsky, JNicodeme, E Discovery and characterization of small molecule inhibitors of the BET family bromodomains. J Med Chem54:3827-38 (2011) 
 
Bromodomain-containing protein 3
Name:Bromodomain-containing protein 3
Type:Protein
Mol. Mass.:79571.81
Organism:Homo sapiens (Human)
Description:Q15059
Residue:726
BDBM50365264
NameBDBM50365264
Synonyms:CHEMBL1738926
TypeSmall organic molecule
Emp. Form.C25H21N5O2
Mol. Mass.423.4665
SMILESCc1nnc2[C@H](NC(=O)OCc3ccccc3)N=C(c3ccccc3)c3ccccc3-n12