Reaction Details
TargetBromodomain-containing protein 3
LigandBDBM50365463
Substrate/Competitorn/a
Meas. Tech.ChEMBL_852811 (CHEMBL2156118)
IC50 42.4±n/a nM
Citation Chung, CWCoste, HWhite, JHMirguet, OWilde, JGosmini, RLDelves, CMagny, SMWoodward, RHughes, SABoursier, EVFlynn, HBouillot, AMBamborough, PBrusq, JMGellibert, FJJones, EJRiou, AMHomes, PMartin, SLUings, IJToum, JClement, CABoullay, ABGrimley, RLBlandel, FMPrinjha, RKLee, KKirilovsky, JNicodeme, E Discovery and characterization of small molecule inhibitors of the BET family bromodomains. J Med Chem54:3827-38 (2011) 
 
Bromodomain-containing protein 3
Name:Bromodomain-containing protein 3
Type:Protein
Mol. Mass.:79571.81
Organism:Homo sapiens (Human)
Description:Q15059
Residue:726
BDBM50365463
NameBDBM50365463
Synonyms:CHEMBL1232461
TypeSmall organic molecule
Emp. Form.C22H22ClN5O2
Mol. Mass.423.895
SMILESCCNC(=O)C[C@@H]1N=C(c2ccc(Cl)cc2)c2cc(OC)ccc2-n2c(C)nnc12