Reaction Details
TargetSuccinate receptor 1
LigandBDBM50393146
Substrate/Competitorn/a
Meas. Tech.ChEMBL_852820 (CHEMBL2156127)
IC50 1000±n/a nM
Citation Bhuniya, DUmrani, DDave, BSalunke, DKukreja, GGundu, JNaykodi, MShaikh, NSShitole, PKurhade, SDe, SMajumdar, SReddy, SBTambe, SShejul, YChugh, APalle, VPMookhtiar, KACully, DVacca, JChakravarty, PKNargund, RPWright, SDGraziano, MPSingh, SBRoy, SCai, TQ Discovery of a potent and selective small molecule hGPR91 antagonist. Bioorg Med Chem Lett21:3596-602 (2011) 
 
Succinate receptor 1
Name:Succinate receptor 1
Type:PROTEIN
Mol. Mass.:38709.48
Organism:Homo sapiens (Human)
Description:ChEMBL_852820
Residue:334
BDBM50393146
NameBDBM50393146
Synonyms:CHEMBL2153584
TypeSmall organic molecule
Emp. Form.C22H17F4N5O2
Mol. Mass.459.3963
SMILESFc1ccc(cc1C(F)(F)F)-c1nnc(CNC(=O)CCCc2ccc3cccnc3n2)o1