Reaction Details
TargetSuccinate receptor 1
LigandBDBM50393152
Substrate/Competitorn/a
Meas. Tech.ChEMBL_852820 (CHEMBL2156127)
IC50 1000±n/a nM
Citation Bhuniya, DUmrani, DDave, BSalunke, DKukreja, GGundu, JNaykodi, MShaikh, NSShitole, PKurhade, SDe, SMajumdar, SReddy, SBTambe, SShejul, YChugh, APalle, VPMookhtiar, KACully, DVacca, JChakravarty, PKNargund, RPWright, SDGraziano, MPSingh, SBRoy, SCai, TQ Discovery of a potent and selective small molecule hGPR91 antagonist. Bioorg Med Chem Lett21:3596-602 (2011) 
 
Succinate receptor 1
Name:Succinate receptor 1
Type:PROTEIN
Mol. Mass.:38709.48
Organism:Homo sapiens (Human)
Description:ChEMBL_852820
Residue:334
BDBM50393152
NameBDBM50393152
Synonyms:CHEMBL2153590
TypeSmall organic molecule
Emp. Form.C25H19ClFN5
Mol. Mass.443.903
SMILESFc1ccc(cc1Cl)-c1ccc(cc1)-c1nnc(CCCc2ccc3cccnc3n2)[nH]1