Reaction Details
Target2-oxoglutarate receptor 1
LigandBDBM50393148
Substrate/Competitorn/a
Meas. Tech.ChEMBL_852825 (CHEMBL2155424)
IC50 5000±n/a nM
Citation Bhuniya, DUmrani, DDave, BSalunke, DKukreja, GGundu, JNaykodi, MShaikh, NSShitole, PKurhade, SDe, SMajumdar, SReddy, SBTambe, SShejul, YChugh, APalle, VPMookhtiar, KACully, DVacca, JChakravarty, PKNargund, RPWright, SDGraziano, MPSingh, SBRoy, SCai, TQ Discovery of a potent and selective small molecule hGPR91 antagonist. Bioorg Med Chem Lett21:3596-602 (2011) 
 
2-oxoglutarate receptor 1
Name:2-oxoglutarate receptor 1
Type:PROTEIN
Mol. Mass.:38261.32
Organism:Homo sapiens (Human)
Description:ChEMBL_852825
Residue:337
BDBM50393148
NameBDBM50393148
Synonyms:CHEMBL2153586
TypeSmall organic molecule
Emp. Form.C25H19ClN4O
Mol. Mass.426.898
SMILESClc1cccc(c1)-c1ccc(cc1)-c1nnc(CCCc2ccc3cccnc3n2)o1