Reaction Details
TargetSolute carrier family 22 member 2
LigandBDBM23620
Substrate/Competitorn/a
Meas. Tech.ChEMBL_852936 (CHEMBL2154120)
IC50 2600±n/a nM
Citation Kido, YMatsson, PGiacomini, KM Profiling of a prescription drug library for potential renal drug-drug interactions mediated by the organic cation transporter 2. J Med Chem54:4548-58 (2011) 
 
Solute carrier family 22 member 2
Name:Solute carrier family 22 member 2
Type:PROTEIN
Mol. Mass.:62591.01
Organism:Homo sapiens (Human)
Description:ChEMBL_1484077
Residue:555
BDBM23620
NameBDBM23620
Synonyms:2-({6-[bis(2-hydroxyethyl)amino]-4,8-bis(piperidin-1-yl)pyrimido[5,4-d][1,3]diazin-2-yl}(2-hydroxyethyl)amino)ethan-1-ol Dipyridamine Dipyudamine Persantine cid_3108
TypeSmall organic molecule
Emp. Form.C24H40N8O4
Mol. Mass.504.6256
SMILESOCCN(CCO)c1nc(N2CCCCC2)c2nc(nc(N3CCCCC3)c2n1)N(CCO)CCO