Reaction Details
TargetAdenosine receptor A1
LigandBDBM50393177
Substrate/Competitorn/a
Meas. Tech.ChEMBL_852592 (CHEMBL2156703)
Ki 2490±n/a nM
Citation Drabczynska, AYuzlenko, OKöse, MPaskaleva, MSchiedel, ACKarolak-Wojciechowska, JHandzlik, JKarcz, TKuder, KMüller, CEKiec-Kononowicz, K Synthesis and biological activity of tricyclic cycloalkylimidazo-, pyrimido- and diazepinopurinediones. Eur J Med Chem46:3590-607 (2011) 
 
Adenosine receptor A1
Name:Adenosine receptor A1
Type:Protein
Mol. Mass.:36704.13
Organism:Rattus norvegicus (rat)
Description:n/a
Residue:326
BDBM50393177
NameBDBM50393177
Synonyms:CHEMBL2153618
TypeSmall organic molecule
Emp. Form.C17H25N5O2
Mol. Mass.331.4127
SMILESCn1c2nc3N(CC4CCCCC4)CCCn3c2c(=O)n(C)c1=O