Reaction Details
TargetAdenosine receptor A2b
LigandBDBM50393192
Substrate/Competitorn/a
Meas. Tech.ChEMBL_853233 (CHEMBL2154934)
Ki 800±n/a nM
Citation Drabczynska, AYuzlenko, OKöse, MPaskaleva, MSchiedel, ACKarolak-Wojciechowska, JHandzlik, JKarcz, TKuder, KMüller, CEKiec-Kononowicz, K Synthesis and biological activity of tricyclic cycloalkylimidazo-, pyrimido- and diazepinopurinediones. Eur J Med Chem46:3590-607 (2011) 
 
Adenosine receptor A2b
Name:Adenosine receptor A2b
Type:G Protein-Coupled Receptor (GPCR)
Mol. Mass.:36341.22
Organism:Homo sapiens (Human)
Description:n/a
Residue:332
BDBM50393192
NameBDBM50393192
Synonyms:CHEMBL2153629
TypeSmall organic molecule
Emp. Form.C17H25N5O2
Mol. Mass.331.4127
SMILESCn1c2nc3N(CCn3c2c(=O)n(C)c1=O)C1CCCCCCC1