Reaction Details
TargetAdenosine receptor A2a
LigandBDBM50393179
Substrate/Competitorn/a
Meas. Tech.ChEMBL_852589 (CHEMBL2156700)
Ki 1300±n/a nM
Citation Drabczynska, AYuzlenko, OKöse, MPaskaleva, MSchiedel, ACKarolak-Wojciechowska, JHandzlik, JKarcz, TKuder, KMüller, CEKiec-Kononowicz, K Synthesis and biological activity of tricyclic cycloalkylimidazo-, pyrimido- and diazepinopurinediones. Eur J Med Chem46:3590-607 (2011) 
 
Adenosine receptor A2a
Name:Adenosine receptor A2a
Type:G Protein-Coupled Receptor (GPCR)
Mol. Mass.:45015.65
Organism:Rattus norvegicus (rat)
Description:Rat A2A receptors expressed in CHO cells.
Residue:410
BDBM50393179
NameBDBM50393179
Synonyms:CHEMBL2153616
TypeSmall organic molecule
Emp. Form.C18H27N5O2
Mol. Mass.345.4393
SMILESC[C@H](C1CCCCC1)N1CCCn2c1nc1n(C)c(=O)n(C)c(=O)c21