Reaction Details
TargetStromelysin-3
LigandBDBM50393211
Substrate/Competitorn/a
Meas. Tech.ChEMBL_850716 (CHEMBL2155985)
Ki 5±n/a nM
Citation Mucha, AKafarski, PBerlicki, L Remarkable potential of thea-aminophosphonate/phosphinate structural motif in medicinal chemistry. J Med Chem54:5955-80 (2011) 
 
Stromelysin-3
Name:Stromelysin-3
Type:PROTEIN
Mol. Mass.:54592.75
Organism:Homo sapiens (Human)
Description:ChEMBL_850716
Residue:488
BDBM50393211
NameBDBM50393211
Synonyms:CHEMBL2153737
TypeSmall organic molecule
Emp. Form.C38H41N4O6P
Mol. Mass.680.7291
SMILESNC(=O)[C@H](Cc1c[nH]c2ccccc12)NC(=O)[C@H](CCc1ccccc1)CP(O)(=O)[C@H](Cc1ccccc1)NC(=O)OCc1ccccc1