Reaction Details
TargetAngiotensin-converting enzyme
LigandBDBM50303320
Substrate/Competitorn/a
Meas. Tech.ChEMBL_850711 (CHEMBL2155980)
Ki 0.65±n/a nM
Citation Mucha, AKafarski, PBerlicki, L Remarkable potential of thea-aminophosphonate/phosphinate structural motif in medicinal chemistry. J Med Chem54:5955-80 (2011) 
 
Angiotensin-converting enzyme
Name:Angiotensin-converting enzyme
Type:Enzyme
Mol. Mass.:149709.01
Organism:Homo sapiens (Human)
Description:n/a
Residue:1306
BDBM50303320
NameBDBM50303320
Synonyms:(S)-2-[(R)-3-[((R)-1-Benzyloxycarbonylamino-2-phenyl-ethyl)-hydroxy-phosphinoyl]-2-(3-phenyl-isoxazol-5-ylmethyl)-propionylamino]-3-(4-hydroxy-phenyl)-propionic acid | CHEMBL570953
TypeSmall organic molecule
Emp. Form.C38H38N3O9P
Mol. Mass.711.6968
SMILESOC(=O)[C@H](Cc1ccc(O)cc1)NC(=O)[C@@H](Cc1cc(no1)-c1ccccc1)CP(O)(=O)[C@H](Cc1ccccc1)NC(=O)OCc1ccccc1