Reaction Details
TargetProtein kinase C epsilon type
LigandBDBM50393214
Substrate/Competitorn/a
Meas. Tech.ChEMBL_850745 (CHEMBL2156014)
IC50 0.700000±n/a nM
Citation Wagner, Jvon Matt, PFaller, BCooke, NGAlbert, RSedrani, RWiegand, HJean, CBeerli, CWeckbecker, GEvenou, JPZenke, GCottens, S Structure-activity relationship and pharmacokinetic studies of sotrastaurin (AEB071), a promising novel medicine for prevention of graft rejection and treatment of psoriasis. J Med Chem54:6028-39 (2011) 
 
Protein kinase C epsilon type
Name:Protein kinase C epsilon type
Type:Enzyme
Mol. Mass.:83680.45
Organism:Homo sapiens (Human)
Description:The recombinant human PKC enzymes were produced using a baculovirus expression system in SF9 cells
Residue:737
BDBM50393214
NameBDBM50393214
Synonyms:CHEMBL2151411
TypeSmall organic molecule
Emp. Form.C26H24N6O2
Mol. Mass.452.5078
SMILESCN1CCN(CC1)c1nc(C2=C(C(=O)NC2=O)c2c[nH]c3c(C)cccc23)c2ccccc2n1