Reaction Details
TargetProtein kinase C delta type
LigandBDBM50393226
Substrate/Competitorn/a
Meas. Tech.ChEMBL_850744 (CHEMBL2156013)
IC50 1.8±n/a nM
Citation Wagner, Jvon Matt, PFaller, BCooke, NGAlbert, RSedrani, RWiegand, HJean, CBeerli, CWeckbecker, GEvenou, JPZenke, GCottens, S Structure-activity relationship and pharmacokinetic studies of sotrastaurin (AEB071), a promising novel medicine for prevention of graft rejection and treatment of psoriasis. J Med Chem54:6028-39 (2011) 
 
Protein kinase C delta type
Name:Protein kinase C delta type
Type:Enzyme
Mol. Mass.:77516.79
Organism:Homo sapiens (Human)
Description:The recombinant human PKC enzymes were produced using a baculovirus expression system in SF9 cells
Residue:676
BDBM50393226
NameBDBM50393226
Synonyms:CHEMBL2153748
TypeSmall organic molecule
Emp. Form.C26H23N5O2
Mol. Mass.437.4931
SMILESCN1CCN(CC1)c1cc2ccccc2c(n1)C1=C(C(=O)NC1=O)c1c[nH]c2ccccc12