Reaction Details
TargetNeuronal acetylcholine receptor subunit alpha-7
LigandBDBM50393248
Substrate/Competitorn/a
Meas. Tech.ChEMBL_851151 (CHEMBL2157808)
EC50 50±n/a nM
Citation Mazurov, AASpeake, JDYohannes, D Discovery and development ofa7 nicotinic acetylcholine receptor modulators. J Med Chem54:7943-61 (2011) 
 
Neuronal acetylcholine receptor subunit alpha-7
Name:Neuronal acetylcholine receptor subunit alpha-7
Type:n/a
Mol. Mass.:56448.33
Organism:Homo sapiens (Human)
Description: CHRNA7 (NACHRA7)
Residue:502
BDBM50393248
NameBDBM50393248
Synonyms:CHEMBL1258005
TypeSmall organic molecule
Emp. Form.C20H22BrN3O
Mol. Mass.400.312
SMILESBrc1ccc(cc1)C(=O)N[C@@H]1C2CCN(CC2)[C@H]1Cc1cccnc1