Reaction Details
TargetNeuronal acetylcholine receptor subunit alpha-7
LigandBDBM50309862
Substrate/Competitorn/a
Meas. Tech.ChEMBL_851150 (CHEMBL2157807)
Ki 22.5±n/a nM
Citation Mazurov, AASpeake, JDYohannes, D Discovery and development ofa7 nicotinic acetylcholine receptor modulators. J Med Chem54:7943-61 (2011) 
 
Neuronal acetylcholine receptor subunit alpha-7
Name:Neuronal acetylcholine receptor subunit alpha-7
Type:n/a
Mol. Mass.:56448.33
Organism:Homo sapiens (Human)
Description: CHRNA7 (NACHRA7)
Residue:502
BDBM50309862
NameBDBM50309862
Synonyms:4-Benzoxazo-2-yl-1,4-diazabicyclo[3.2.2]nonane | CHEMBL611082
TypeSmall organic molecule
Emp. Form.C14H17N3O
Mol. Mass.243.3043
SMILESC1CN2CCC1N(CC2)c1nc2ccccc2o1