Reaction Details
Target5-hydroxytryptamine receptor 3A
LigandBDBM50309873
Substrate/Competitorn/a
Meas. Tech.ChEMBL_851152 (CHEMBL2157809)
Ki 1370±n/a nM
Citation Mazurov, AASpeake, JDYohannes, D Discovery and development ofa7 nicotinic acetylcholine receptor modulators. J Med Chem54:7943-61 (2011) 
 
5-hydroxytryptamine receptor 3A
Name:5-hydroxytryptamine receptor 3A
Type:Protein
Mol. Mass.:55283.27
Organism:Homo sapiens (Human)
Description:P46098
Residue:478
BDBM50309873
NameBDBM50309873
Synonyms:4-(6-Chlorooxazolo[4,5-b]pyridin-2-yl)-1,4-diazabicyclo[3.2.2]-nonane | CHEMBL597241
TypeSmall organic molecule
Emp. Form.C13H15ClN4O
Mol. Mass.278.737
SMILESClc1cnc2nc(oc2c1)N1CCN2CCC1CC2