Reaction Details
TargetPotassium voltage-gated channel subfamily H member 2
LigandBDBM50309873
Substrate/Competitorn/a
Meas. Tech.ChEMBL_851153 (CHEMBL2157810)
IC50 3300±n/a nM
Citation Mazurov, AASpeake, JDYohannes, D Discovery and development ofa7 nicotinic acetylcholine receptor modulators. J Med Chem54:7943-61 (2011) 
 
Potassium voltage-gated channel subfamily H member 2
Name:Potassium voltage-gated channel subfamily H member 2
Type:Multi-pass membrane protein
Mol. Mass.:126672.65
Organism:Homo sapiens (Human)
Description:Q12809
Residue:1159
BDBM50309873
NameBDBM50309873
Synonyms:4-(6-Chlorooxazolo[4,5-b]pyridin-2-yl)-1,4-diazabicyclo[3.2.2]-nonane | CHEMBL597241
TypeSmall organic molecule
Emp. Form.C13H15ClN4O
Mol. Mass.278.737
SMILESClc1cnc2nc(oc2c1)N1CCN2CCC1CC2