Reaction Details
Target5-hydroxytryptamine receptor 3A
LigandBDBM50309888
Substrate/Competitorn/a
Meas. Tech.ChEMBL_851149 (CHEMBL2157806)
IC50 70±n/a nM
Citation Mazurov, AASpeake, JDYohannes, D Discovery and development ofa7 nicotinic acetylcholine receptor modulators. J Med Chem54:7943-61 (2011) 
 
5-hydroxytryptamine receptor 3A
Name:5-hydroxytryptamine receptor 3A
Type:Protein
Mol. Mass.:55283.27
Organism:Homo sapiens (Human)
Description:P46098
Residue:478
BDBM50309888
NameBDBM50309888
Synonyms:4-(6-Chloro-5-methyloxazolo[4,5-b]pyridin-2-yl)-1,4-diazabicyclo-[3.2.2]nonane | CHEMBL603052
TypeSmall organic molecule
Emp. Form.C14H17ClN4O
Mol. Mass.292.764
SMILESCc1nc2nc(oc2cc1Cl)N1CCN2CCC1CC2