Reaction Details
TargetNeuronal acetylcholine receptor subunit alpha-7
LigandBDBM50278956
Substrate/Competitorn/a
Meas. Tech.ChEMBL_851186 (CHEMBL2157843)
Ki 17±n/a nM
Citation Mazurov, AASpeake, JDYohannes, D Discovery and development ofa7 nicotinic acetylcholine receptor modulators. J Med Chem54:7943-61 (2011) 
 
Neuronal acetylcholine receptor subunit alpha-7
Name:Neuronal acetylcholine receptor subunit alpha-7
Type:n/a
Mol. Mass.:56448.33
Organism:Homo sapiens (Human)
Description: CHRNA7 (NACHRA7)
Residue:502
BDBM50278956
NameBDBM50278956
Synonyms:(3aR,6aS)-2-methyl-5-(6-phenylpyridazin-3-yl)octahydropyrrolo[3,4-c]pyrrole CHEMBL526281 | cis-2-(6-Phenyl-pyridazin-3-yl)-5-methyloctahydro-pyrrolo[3,4-c]-pyrrole
TypeSmall organic molecule
Emp. Form.C17H20N4
Mol. Mass.280.3675
SMILESCN1C[C@H]2CN(C[C@H]2C1)c1ccc(nn1)-c1ccccc1