Reaction Details
TargetNeuronal acetylcholine receptor subunit alpha-7
LigandBDBM50393256
Substrate/Competitorn/a
Meas. Tech.ChEMBL_851150 (CHEMBL2157807)
Ki 28±n/a nM
Citation Mazurov, AASpeake, JDYohannes, D Discovery and development ofa7 nicotinic acetylcholine receptor modulators. J Med Chem54:7943-61 (2011) 
 
Neuronal acetylcholine receptor subunit alpha-7
Name:Neuronal acetylcholine receptor subunit alpha-7
Type:n/a
Mol. Mass.:56448.33
Organism:Homo sapiens (Human)
Description: CHRNA7 (NACHRA7)
Residue:502
BDBM50393256
NameBDBM50393256
Synonyms:CHEMBL2113232
TypeSmall organic molecule
Emp. Form.C17H18N2O2S
Mol. Mass.314.402
SMILESO=C1O[C@@]2(CN1c1ccc3sccc3c1)CN1CCC2CC1