Reaction Details
TargetNeuronal acetylcholine receptor subunit alpha-7
LigandBDBM50393251
Substrate/Competitorn/a
Meas. Tech.ChEMBL_851151 (CHEMBL2157808)
EC50 320±n/a nM
Citation Mazurov, AASpeake, JDYohannes, D Discovery and development ofa7 nicotinic acetylcholine receptor modulators. J Med Chem54:7943-61 (2011) 
 
Neuronal acetylcholine receptor subunit alpha-7
Name:Neuronal acetylcholine receptor subunit alpha-7
Type:n/a
Mol. Mass.:56448.33
Organism:Homo sapiens (Human)
Description: CHRNA7 (NACHRA7)
Residue:502
BDBM50393251
NameBDBM50393251
Synonyms:CHEMBL2151569
TypeSmall organic molecule
Emp. Form.C19H21N5
Mol. Mass.319.4035
SMILESCN1CC2CN(CC2C1)c1ccc(nn1)-c1ccc2[nH]ccc2c1