Reaction Details
TargetDelta-type opioid receptor
LigandBDBM50393257
Substrate/Competitorn/a
Meas. Tech.ChEMBL_851384 (CHEMBL2156214)
Ki 5±n/a nM
Citation Vandormael, BFourla, DDGramowski-Voss, AKosson, PWeiss, DGSchröder, OHLipkowski, AGeorgoussi, ZTourwé, D Superpotent [Dmt¹] dermorphin tetrapeptides containing the 4-aminotetrahydro-2-benzazepin-3-one scaffold with mixedµ/d opioid receptor agonistic properties. J Med Chem54:7848-59 (2011) 
 
Delta-type opioid receptor
Name:Delta-type opioid receptor
Type:G Protein-Coupled Receptor (GPCR)
Mol. Mass.:40382.98
Organism:Homo sapiens (Human)
Description:Competition binding assays were carried out using membrane preparations from transfected HN9.10 cells that constitutively expressed the delta opioid receptor.
Residue:372
BDBM50393257
NameBDBM50393257
Synonyms:CHEMBL2151735
TypeSmall organic molecule
Emp. Form.C27H35N5O5
Mol. Mass.509.5973
SMILESC[C@@H](N(C)C(=O)[C@@H](N)Cc1c(C)cc(O)cc1C)C(=O)N[C@H]1Cc2ccccc2CN(CC(N)=O)C1=O