Reaction Details
TargetDelta-type opioid receptor
LigandBDBM50376594
Substrate/Competitorn/a
Meas. Tech.ChEMBL_851384 (CHEMBL2156214)
Ki>10000±n/a nM
Citation Vandormael, BFourla, DDGramowski-Voss, AKosson, PWeiss, DGSchröder, OHLipkowski, AGeorgoussi, ZTourwé, D Superpotent [Dmt¹] dermorphin tetrapeptides containing the 4-aminotetrahydro-2-benzazepin-3-one scaffold with mixedµ/d opioid receptor agonistic properties. J Med Chem54:7848-59 (2011) 
 
Delta-type opioid receptor
Name:Delta-type opioid receptor
Type:G Protein-Coupled Receptor (GPCR)
Mol. Mass.:40382.98
Organism:Homo sapiens (Human)
Description:Competition binding assays were carried out using membrane preparations from transfected HN9.10 cells that constitutively expressed the delta opioid receptor.
Residue:372
BDBM50376594
NameBDBM50376594
Synonyms:CHEMBL260120
TypeSmall organic molecule
Emp. Form.C25H33N5O5
Mol. Mass.483.56
SMILESC[C@@H](N(C)C(=O)[C@@H](N)Cc1ccc(O)cc1)C(=O)N[C@@H](Cc1ccccc1)C(=O)N(C)CC(N)=O