Reaction Details
TargetMu-type opioid receptor
LigandBDBM50354650
Substrate/Competitorn/a
Meas. Tech.ChEMBL_851389 (CHEMBL2156219)
EC50 0.083200±n/a nM
Citation Vandormael, BFourla, DDGramowski-Voss, AKosson, PWeiss, DGSchröder, OHLipkowski, AGeorgoussi, ZTourwé, D Superpotent [Dmt¹] dermorphin tetrapeptides containing the 4-aminotetrahydro-2-benzazepin-3-one scaffold with mixedµ/d opioid receptor agonistic properties. J Med Chem54:7848-59 (2011) 
 
Mu-type opioid receptor
Name:Mu-type opioid receptor
Type:G Protein-Coupled Receptor (GPCR)
Mol. Mass.:44789.51
Organism:Homo sapiens (Human)
Description:P35372
Residue:400
BDBM50354650
NameBDBM50354650
Synonyms:CHEMBL1834247
TypeSmall organic molecule
Emp. Form.C26H33N5O5
Mol. Mass.495.5707
SMILESC[C@@H](NC(=O)[C@@H](N)Cc1c(C)cc(O)cc1C)C(=O)N[C@H]1Cc2ccccc2CN(CC(N)=O)C1=O