Reaction Details
TargetCytochrome P450 3A4
LigandBDBM50273444
Substrate/Competitorn/a
Meas. Tech.ChEMBL_851741 (CHEMBL2156083)
Ki 700±n/a nM
Citation Dahal, UPJoswig-Jones, CJones, JP Comparative study of the affinity and metabolism of type I and type II binding quinoline carboxamide analogues by cytochrome P450 3A4. J Med Chem55:280-90 (2012) 
 
Cytochrome P450 3A4
Name:Cytochrome P450 3A4
Type:Enzyme
Mol. Mass.:57349.57
Organism:Homo sapiens (Human)
Description:n/a
Residue:503
BDBM50273444
NameBDBM50273444
Synonyms:CHEMBL463976 | N-Phenyl-2-(pyridin-4-yl)quinoline-4-carboxamide
TypeSmall organic molecule
Emp. Form.C21H15N3O
Mol. Mass.325.3633
SMILESO=C(Nc1ccccc1)c1cc(nc2ccccc12)-c1ccncc1