Reaction Details
TargetHypoxia-inducible factor 1-alpha
LigandBDBM50393281
Substrate/Competitorn/a
Meas. Tech.ChEMBL_851753 (CHEMBL2156221)
EC50 2390±n/a nM
Citation Theriault, JRFelts, ASBates, BSPerez, JRPalmer, MGilbert, SRDawson, ESEngers, JLLindsley, CWEmmitte, KA Discovery of a new molecular probe ML228: an activator of the hypoxia inducible factor (HIF) pathway. Bioorg Med Chem Lett22:76-81 (2011) 
 
Hypoxia-inducible factor 1-alpha
Name:Hypoxia-inducible factor 1-alpha
Type:Protein
Mol. Mass.:92647.24
Organism:Homo sapiens (Human)
Description:Q16665
Residue:826
BDBM50393281
NameBDBM50393281
Synonyms:CHEMBL2139973
TypeSmall organic molecule
Emp. Form.C22H19N5
Mol. Mass.353.4198
SMILESCc1cccc(CNc2nc(nnc2-c2ccccc2)-c2ccccn2)c1