Reaction Details
TargetHypoxia-inducible factor 1-alpha
LigandBDBM50393295
Substrate/Competitorn/a
Meas. Tech.ChEMBL_851754 (CHEMBL2156222)
EC50 2570±n/a nM
Citation Theriault, JRFelts, ASBates, BSPerez, JRPalmer, MGilbert, SRDawson, ESEngers, JLLindsley, CWEmmitte, KA Discovery of a new molecular probe ML228: an activator of the hypoxia inducible factor (HIF) pathway. Bioorg Med Chem Lett22:76-81 (2011) 
 
Hypoxia-inducible factor 1-alpha
Name:Hypoxia-inducible factor 1-alpha
Type:Protein
Mol. Mass.:92647.24
Organism:Homo sapiens (Human)
Description:Q16665
Residue:826
BDBM50393295
NameBDBM50393295
Synonyms:CHEMBL2135309
TypeSmall organic molecule
Emp. Form.C27H21N5
Mol. Mass.415.4891
SMILESC(Nc1nc(nnc1-c1ccccc1)-c1ccccn1)c1cccc(c1)-c1ccccc1