Reaction Details
Target5-hydroxytryptamine receptor 6
LigandBDBM20607
Substrate/Competitorn/a
Meas. Tech.ChEMBL_852004 (CHEMBL2157129)
Ki 1041±n/a nM
Citation Hajjo, RSetola, VRoth, BLTropsha, A Chemocentric informatics approach to drug discovery: identification and experimental validation of selective estrogen receptor modulators as ligands of 5-hydroxytryptamine-6 receptors and as potential cognition enhancers. J Med Chem55:5704-19 (2012) 
 
5-hydroxytryptamine receptor 6
Name:5-hydroxytryptamine receptor 6
Type:G Protein-Coupled Receptor (GPCR)
Mol. Mass.:46968.43
Organism:Homo sapiens (Human)
Description:P50406
Residue:440
BDBM20607
NameBDBM20607
Synonyms:(2-{4-[(1Z)-1,2-diphenylbut-1-en-1-yl]phenoxy}ethyl)dimethylamine CHEMBL83 NCGC00024928 Tamoxifen Tamoxifen, 7 med.21724, Compound Tamoxifen
TypeSmall organic molecule
Emp. Form.C26H29NO
Mol. Mass.371.5146
SMILESCC\C(=C(/c1ccccc1)c1ccc(OCCN(C)C)cc1)c1ccccc1