Reaction Details
TargetPhosphatidylinositol 4,5-bisphosphate 3-kinase catalytic subunit gamma isoform
LigandBDBM50393338
Substrate/Competitorn/a
Meas. Tech.ChEMBL_852007 (CHEMBL2157132)
IC50 39±n/a nM
Citation Leahy, JWBuhr, CAJohnson, HWKim, BGBaik, TCannoy, JForsyth, TPJeong, JWLee, MSMa, SNoson, KWang, LWilliams, MNuss, JMBrooks, EFoster, PGoon, LHeald, NHolst, CJaeger, CLam, SLougheed, JNguyen, LPlonowski, ASong, JStout, TWu, XYakes, MFYu, PZhang, WLamb, PRaeber, O Discovery of a novel series of potent and orally bioavailable phosphoinositide 3-kinase¿ inhibitors. J Med Chem55:5467-82 (2012) 
 
Phosphatidylinositol 4,5-bisphosphate 3-kinase catalytic subunit gamma isoform
Name:Phosphatidylinositol 4,5-bisphosphate 3-kinase catalytic subunit gamma isoform
Type:Enzyme Subunit
Mol. Mass.:126470.30
Organism:Homo sapiens (Human)
Description:P48736
Residue:1102
BDBM50393338
NameBDBM50393338
Synonyms:CHEMBL2152130
TypeSmall organic molecule
Emp. Form.C18H16ClN5O3S
Mol. Mass.417.869
SMILESCNC(=O)c1nc(cnc1N)-c1ccc(Cl)c(c1)S(=O)(=O)Nc1ccccc1