Reaction Details
TargetPhosphatidylinositol 4,5-bisphosphate 3-kinase catalytic subunit gamma isoform
LigandBDBM50393346
Substrate/Competitorn/a
Meas. Tech.ChEMBL_852007 (CHEMBL2157132)
IC50 167±n/a nM
Citation Leahy, JWBuhr, CAJohnson, HWKim, BGBaik, TCannoy, JForsyth, TPJeong, JWLee, MSMa, SNoson, KWang, LWilliams, MNuss, JMBrooks, EFoster, PGoon, LHeald, NHolst, CJaeger, CLam, SLougheed, JNguyen, LPlonowski, ASong, JStout, TWu, XYakes, MFYu, PZhang, WLamb, PRaeber, O Discovery of a novel series of potent and orally bioavailable phosphoinositide 3-kinase¿ inhibitors. J Med Chem55:5467-82 (2012) 
 
Phosphatidylinositol 4,5-bisphosphate 3-kinase catalytic subunit gamma isoform
Name:Phosphatidylinositol 4,5-bisphosphate 3-kinase catalytic subunit gamma isoform
Type:Enzyme Subunit
Mol. Mass.:126470.30
Organism:Homo sapiens (Human)
Description:P48736
Residue:1102
BDBM50393346
NameBDBM50393346
Synonyms:CHEMBL2152137
TypeSmall organic molecule
Emp. Form.C18H17N5O3S
Mol. Mass.383.424
SMILESCNC(=O)c1nc(cnc1N)-c1cccc(NS(=O)(=O)c2ccccc2)c1