Reaction Details
TargetPhosphatidylinositol 4,5-bisphosphate 3-kinase catalytic subunit beta isoform
LigandBDBM50393365
Substrate/Competitorn/a
Meas. Tech.ChEMBL_852010 (CHEMBL2157135)
IC50 39±n/a nM
Citation Leahy, JWBuhr, CAJohnson, HWKim, BGBaik, TCannoy, JForsyth, TPJeong, JWLee, MSMa, SNoson, KWang, LWilliams, MNuss, JMBrooks, EFoster, PGoon, LHeald, NHolst, CJaeger, CLam, SLougheed, JNguyen, LPlonowski, ASong, JStout, TWu, XYakes, MFYu, PZhang, WLamb, PRaeber, O Discovery of a novel series of potent and orally bioavailable phosphoinositide 3-kinase¿ inhibitors. J Med Chem55:5467-82 (2012) 
 
Phosphatidylinositol 4,5-bisphosphate 3-kinase catalytic subunit beta isoform
Name:Phosphatidylinositol 4,5-bisphosphate 3-kinase catalytic subunit beta isoform
Type:Enzyme Subunit
Mol. Mass.:122769.00
Organism:Homo sapiens (Human)
Description:P42338
Residue:1070
BDBM50393365
NameBDBM50393365
Synonyms:CHEMBL2152257
TypeSmall organic molecule
Emp. Form.C18H12ClF5N4O3S
Mol. Mass.494.823
SMILESNc1ncc(-c2ccc(Cl)c(c2)S(=O)(=O)Nc2cccc(F)c2F)c(OCC(F)(F)F)n1