Reaction Details
TargetPhosphatidylinositol 4,5-bisphosphate 3-kinase catalytic subunit delta isoform
LigandBDBM50393340
Substrate/Competitorn/a
Meas. Tech.ChEMBL_852011 (CHEMBL2157136)
IC50 638±n/a nM
Citation Leahy, JWBuhr, CAJohnson, HWKim, BGBaik, TCannoy, JForsyth, TPJeong, JWLee, MSMa, SNoson, KWang, LWilliams, MNuss, JMBrooks, EFoster, PGoon, LHeald, NHolst, CJaeger, CLam, SLougheed, JNguyen, LPlonowski, ASong, JStout, TWu, XYakes, MFYu, PZhang, WLamb, PRaeber, O Discovery of a novel series of potent and orally bioavailable phosphoinositide 3-kinase¿ inhibitors. J Med Chem55:5467-82 (2012) 
 
Phosphatidylinositol 4,5-bisphosphate 3-kinase catalytic subunit delta isoform
Name:Phosphatidylinositol 4,5-bisphosphate 3-kinase catalytic subunit delta isoform
Type:Enzyme Subunit
Mol. Mass.:119489.41
Organism:Homo sapiens (Human)
Description:O00329
Residue:1044
BDBM50393340
NameBDBM50393340
Synonyms:CHEMBL2152132
TypeSmall organic molecule
Emp. Form.C12H12ClN5O3S
Mol. Mass.341.773
SMILESCNC(=O)c1nc(cnc1N)-c1ccc(Cl)c(c1)S(N)(=O)=O