Reaction Details
TargetPhosphatidylinositol 4,5-bisphosphate 3-kinase catalytic subunit delta isoform
LigandBDBM50393344
Substrate/Competitorn/a
Meas. Tech.ChEMBL_852011 (CHEMBL2157136)
IC50 1582±n/a nM
Citation Leahy, JWBuhr, CAJohnson, HWKim, BGBaik, TCannoy, JForsyth, TPJeong, JWLee, MSMa, SNoson, KWang, LWilliams, MNuss, JMBrooks, EFoster, PGoon, LHeald, NHolst, CJaeger, CLam, SLougheed, JNguyen, LPlonowski, ASong, JStout, TWu, XYakes, MFYu, PZhang, WLamb, PRaeber, O Discovery of a novel series of potent and orally bioavailable phosphoinositide 3-kinase¿ inhibitors. J Med Chem55:5467-82 (2012) 
 
Phosphatidylinositol 4,5-bisphosphate 3-kinase catalytic subunit delta isoform
Name:Phosphatidylinositol 4,5-bisphosphate 3-kinase catalytic subunit delta isoform
Type:Enzyme Subunit
Mol. Mass.:119489.41
Organism:Homo sapiens (Human)
Description:O00329
Residue:1044
BDBM50393344
NameBDBM50393344
Synonyms:CHEMBL2152135
TypeSmall organic molecule
Emp. Form.C18H16FN5O3S
Mol. Mass.401.415
SMILESCNC(=O)c1nc(cnc1N)-c1ccc(F)c(c1)S(=O)(=O)Nc1ccccc1