Reaction Details
Target5-hydroxytryptamine receptor 7
LigandBDBM50130261
Substrate/Competitorn/a
Meas. Tech.ChEMBL_855538 (CHEMBL2162843)
Ki 3.2±n/a nM
Citation Zajdel, PKurczab, RGrychowska, KSatala, GPawlowski, MBojarski, AJ The multiobjective based design, synthesis and evaluation of the arylsulfonamide/amide derivatives of aryloxyethyl- and arylthioethyl- piperidines and pyrrolidines as a novel class of potent 5-HT7 receptor antagonists. Eur J Med Chem56:348-360 (2012) 
 
5-hydroxytryptamine receptor 7
Name:5-hydroxytryptamine receptor 7
Type:G Protein-Coupled Receptor (GPCR)
Mol. Mass.:53573.08
Organism:Homo sapiens (Human)
Description:P34969
Residue:479
BDBM50130261
NameBDBM50130261
Synonyms:6-(2-{2-[4-(4-Chloro-phenoxy)-piperidin-1-yl]-ethyl}-pyrrolidine-1-sulfonyl)-1H-indole; hydrochloride CHEMBL95104
TypeSmall organic molecule
Emp. Form.C25H30ClN3O3S
Mol. Mass.488.042
SMILESClc1ccc(OC2CCN(CC[C@H]3CCCN3S(=O)(=O)c3ccc4cc[nH]c4c3)CC2)cc1