Reaction Details
TargetBotulinum neurotoxin type A
LigandBDBM43865
Substrate/Competitorn/a
Meas. Tech.ChEMBL_855545 (CHEMBL2162850)
Ki 6700±n/a nM
Citation Eubanks, LMSilhár, PSalzameda, NTZakhari, JSXiaochuan, FBarbieri, JTShoemaker, CBHixon, MSJanda, KD Identification of a Natural Product Antagonist against the Botulinum Neurotoxin Light Chain Protease. ACS Med Chem Lett1:268-272 (2010) 
 
Botulinum neurotoxin type A
Name:Botulinum neurotoxin type A
Type:PROTEIN
Mol. Mass.:149450.01
Organism:Clostridium botulinum
Description:ChEMBL_1510137
Residue:1296
BDBM43865
NameBDBM43865
Synonyms:6-formyl-4,7-dihydroxy-9-keto-5H-phenazine-1-carboxylic acid methyl ester Glycopeptide, 4 MLS000766240 cid_5351222 methyl 6-methanoyl-4,7-bis(oxidanyl)-9-oxidanylidene-5H-phenazine-1-carboxylate
TypePeptide
Emp. Form.C15H10N2O6
Mol. Mass.314.2497
SMILESCOC(=O)c1ccc(O)c2nc3c(C=O)c(O)cc(O)c3nc12