Reaction Details
TargetUbiquitin carboxyl-terminal hydrolase 7
LigandBDBM50393438
Substrate/Competitorn/a
Meas. Tech.ChEMBL_855559 (CHEMBL2162864)
EC50>31600±n/a nM
Citation Weinstock, JWu, JCao, PKingsbury, WDMcDermott, JLKodrasov, MPMcKelvey, DMSuresh Kumar, KGGoldenberg, SJMattern, MRNicholson, B Selective Dual Inhibitors of the Cancer-Related Deubiquitylating Proteases USP7 and USP47. ACS Med Chem Lett3:789-792 (2012) 
 
Ubiquitin carboxyl-terminal hydrolase 7
Name:Ubiquitin carboxyl-terminal hydrolase 7
Type:PROTEIN
Mol. Mass.:128274.45
Organism:Homo sapiens (Human)
Description:ChEMBL_1469483
Residue:1102
BDBM50393438
NameBDBM50393438
Synonyms:CHEMBL2159496
TypeSmall organic molecule
Emp. Form.C12H9NO3S2
Mol. Mass.279.335
SMILESCC(=O)c1cc(c(Sc2ccccc2)s1)[N+]([O-])=O