Reaction Details
TargetUbiquitin carboxyl-terminal hydrolase 7
LigandBDBM50393440
Substrate/Competitorn/a
Meas. Tech.ChEMBL_855559 (CHEMBL2162864)
EC50 8000±n/a nM
Citation Weinstock, JWu, JCao, PKingsbury, WDMcDermott, JLKodrasov, MPMcKelvey, DMSuresh Kumar, KGGoldenberg, SJMattern, MRNicholson, B Selective Dual Inhibitors of the Cancer-Related Deubiquitylating Proteases USP7 and USP47. ACS Med Chem Lett3:789-792 (2012) 
 
Ubiquitin carboxyl-terminal hydrolase 7
Name:Ubiquitin carboxyl-terminal hydrolase 7
Type:PROTEIN
Mol. Mass.:128274.45
Organism:Homo sapiens (Human)
Description:ChEMBL_1469483
Residue:1102
BDBM50393440
NameBDBM50393440
Synonyms:CHEMBL2159498
TypeSmall organic molecule
Emp. Form.C12H7F2NO3S2
Mol. Mass.315.316
SMILESCC(=O)c1cc(c(Sc2ccc(F)cc2F)s1)[N+]([O-])=O