Reaction Details
TargetUbiquitin carboxyl-terminal hydrolase 7
LigandBDBM50393441
Substrate/Competitorn/a
Meas. Tech.ChEMBL_855559 (CHEMBL2162864)
EC50 2200±n/a nM
Citation Weinstock, JWu, JCao, PKingsbury, WDMcDermott, JLKodrasov, MPMcKelvey, DMSuresh Kumar, KGGoldenberg, SJMattern, MRNicholson, B Selective Dual Inhibitors of the Cancer-Related Deubiquitylating Proteases USP7 and USP47. ACS Med Chem Lett3:789-792 (2012) 
 
Ubiquitin carboxyl-terminal hydrolase 7
Name:Ubiquitin carboxyl-terminal hydrolase 7
Type:PROTEIN
Mol. Mass.:128274.45
Organism:Homo sapiens (Human)
Description:ChEMBL_1469483
Residue:1102
BDBM50393441
NameBDBM50393441
Synonyms:CHEMBL2159499
TypeSmall organic molecule
Emp. Form.C12H7Cl2NO3S2
Mol. Mass.348.225
SMILESCC(=O)c1cc(c(Sc2c(Cl)cccc2Cl)s1)[N+]([O-])=O