Reaction Details
TargetUbiquitin carboxyl-terminal hydrolase 7
LigandBDBM50393446
Substrate/Competitorn/a
Meas. Tech.ChEMBL_855559 (CHEMBL2162864)
EC50 400±n/a nM
Citation Weinstock, JWu, JCao, PKingsbury, WDMcDermott, JLKodrasov, MPMcKelvey, DMSuresh Kumar, KGGoldenberg, SJMattern, MRNicholson, B Selective Dual Inhibitors of the Cancer-Related Deubiquitylating Proteases USP7 and USP47. ACS Med Chem Lett3:789-792 (2012) 
 
Ubiquitin carboxyl-terminal hydrolase 7
Name:Ubiquitin carboxyl-terminal hydrolase 7
Type:PROTEIN
Mol. Mass.:128274.45
Organism:Homo sapiens (Human)
Description:ChEMBL_1469483
Residue:1102
BDBM50393446
NameBDBM50393446
Synonyms:CHEMBL2159505
TypeSmall organic molecule
Emp. Form.C17H11Cl2N3O5S3
Mol. Mass.504.387
SMILESCS(=O)(=O)c1ccc(NC(=O)c2cc(c(Sc3c(Cl)cncc3Cl)s2)[N+]([O-])=O)cc1