Reaction Details
TargetUbiquitin carboxyl-terminal hydrolase 7
LigandBDBM50393447
Substrate/Competitorn/a
Meas. Tech.ChEMBL_855559 (CHEMBL2162864)
EC50 19000±n/a nM
Citation Weinstock, JWu, JCao, PKingsbury, WDMcDermott, JLKodrasov, MPMcKelvey, DMSuresh Kumar, KGGoldenberg, SJMattern, MRNicholson, B Selective Dual Inhibitors of the Cancer-Related Deubiquitylating Proteases USP7 and USP47. ACS Med Chem Lett3:789-792 (2012) 
 
Ubiquitin carboxyl-terminal hydrolase 7
Name:Ubiquitin carboxyl-terminal hydrolase 7
Type:PROTEIN
Mol. Mass.:128274.45
Organism:Homo sapiens (Human)
Description:ChEMBL_1469483
Residue:1102
BDBM50393447
NameBDBM50393447
Synonyms:CHEMBL2159506
TypeSmall organic molecule
Emp. Form.C13H7Cl2NOS2
Mol. Mass.328.237
SMILESCC(=O)c1cc(C#N)c(Sc2ccc(Cl)cc2Cl)s1