Reaction Details
TargetTyrosine-protein phosphatase non-receptor type 22
LigandBDBM50393489
Substrate/Competitorn/a
Meas. Tech.ChEMBL_855963 (CHEMBL2161837)
IC50 9720±n/a nM
Citation Stanford, SMKrishnamurthy, DFalk, MDMessina, RDebnath, BLi, SLiu, TKazemi, RDahl, RHe, YYu, XChan, ACZhang, ZYBarrios, AMWoods, VLNeamati, NBottini, N Discovery of a novel series of inhibitors of lymphoid tyrosine phosphatase with activity in human T cells. J Med Chem54:1640-54 (2011) 
 
Tyrosine-protein phosphatase non-receptor type 22
Name:Tyrosine-protein phosphatase non-receptor type 22
Type:n/a
Mol. Mass.:91712.31
Organism:Homo sapiens (Human)
Description:Q9Y2R2
Residue:807
BDBM50393489
NameBDBM50393489
Synonyms:CHEMBL2159963
TypeSmall organic molecule
Emp. Form.C35H39N7O
Mol. Mass.573.7305
SMILESCc1cc(C)c2[nH]c(=O)c(cc2c1)C(N1CCN(CC1)C(c1ccccc1)c1ccccc1)c1nnnn1C1CCCC1