Reaction Details
TargetTyrosine-protein phosphatase non-receptor type 22
LigandBDBM50393461
Substrate/Competitorn/a
Meas. Tech.ChEMBL_855966 (CHEMBL2161840)
Ki 10650±n/a nM
Citation Stanford, SMKrishnamurthy, DFalk, MDMessina, RDebnath, BLi, SLiu, TKazemi, RDahl, RHe, YYu, XChan, ACZhang, ZYBarrios, AMWoods, VLNeamati, NBottini, N Discovery of a novel series of inhibitors of lymphoid tyrosine phosphatase with activity in human T cells. J Med Chem54:1640-54 (2011) 
 
Tyrosine-protein phosphatase non-receptor type 22
Name:Tyrosine-protein phosphatase non-receptor type 22
Type:n/a
Mol. Mass.:91712.31
Organism:Homo sapiens (Human)
Description:Q9Y2R2
Residue:807
BDBM50393461
NameBDBM50393461
Synonyms:CHEMBL2159938
TypeSmall organic molecule
Emp. Form.C34H38N6O
Mol. Mass.546.7051
SMILESCC(C)c1ccc(CN(Cc2ccccc2)C(c2nnnn2C2CCCC2)c2cc3cc(C)ccc3[nH]c2=O)cc1