Reaction Details
TargetTyrosine-protein phosphatase non-receptor type 12
LigandBDBM50393498
Substrate/Competitorn/a
Meas. Tech.ChEMBL_855962 (CHEMBL2161836)
IC50 27500±n/a nM
Citation Stanford, SMKrishnamurthy, DFalk, MDMessina, RDebnath, BLi, SLiu, TKazemi, RDahl, RHe, YYu, XChan, ACZhang, ZYBarrios, AMWoods, VLNeamati, NBottini, N Discovery of a novel series of inhibitors of lymphoid tyrosine phosphatase with activity in human T cells. J Med Chem54:1640-54 (2011) 
 
Tyrosine-protein phosphatase non-receptor type 12
Name:Tyrosine-protein phosphatase non-receptor type 12
Type:Protein
Mol. Mass.:88089.78
Organism:Homo sapiens (Human)
Description:Q05209
Residue:780
BDBM50393498
NameBDBM50393498
Synonyms:CHEMBL2159930
TypeSmall organic molecule
Emp. Form.C22H21N3OS
Mol. Mass.375.487
SMILESCc1ccc(NC(=O)CSc2nc3c(C)c(C)ccc3cc2C#N)cc1C